{"text_format":"1","workbook":"xlsx","n_sheets":6,"sheets":["Part A)-Petrographic Number(PN)","GOOD","FAIR","POOR","DELETERIOUS","Full"],"not_rendered":{"charts":0,"images":4,"macros":1,"external_links":0,"defined_names":2,"comments":1,"pivot_tables":0},"unopened":[],"bounds":{"document_bytes":16777216,"sheet_cells":100000,"rows_first":2000,"rows_last":500,"rows_between":2000,"halvings":0,"cell_chars":16384,"cell_head_chars":4096},"cells_cut":0,"cells_raw":0,"read":"whole","date_system":"1900"}

{"sheet":"Part A)-Petrographic Number(PN)","index":0,"n_rows":76,"n_cols":27,"rows_kept":76,"cut":false,"hidden":false,"merged":[[23,8,23,9],[31,8,31,9],[28,0,28,2],[31,0,31,2],[32,0,32,2],[43,0,43,2],[46,0,46,2],[34,8,34,9],[35,8,35,9],[37,8,37,9],[42,8,42,9],[32,8,32,9],[38,8,38,9],[39,8,39,9],[36,5,36,6],[38,0,38,2],[38,5,38,6],[39,0,39,2],[39,5,39,6],[42,5,42,6],[43,5,43,6],[27,0,27,2],[26,0,26,2],[25,0,25,2],[2,7,2,10],[2,11,2,12],[71,2,71,3],[71,10,71,11],[71,12,71,13],[73,15,73,16],[74,15,74,16],[69,14,70,14],[70,2,70,3],[64,14,68,14],[20,5,20,6],[21,5,21,6],[29,8,29,9],[30,8,30,9],[25,5,25,6],[26,5,26,6],[27,5,27,6],[28,5,28,6],[29,5,29,6],[33,5,33,6],[9,8,9,9],[10,5,10,6],[11,5,11,6],[8,0,9,2],[0,1,0,14],[7,7,7,10],[1,1,1,2],[1,7,1,10],[1,13,1,14],[5,1,5,2],[7,11,7,14],[1,11,1,12],[1,3,1,6],[5,3,5,6],[7,0,7,2],[4,1,4,2],[4,3,4,6],[4,11,4,12],[6,1,6,2],[6,3,6,6],[6,7,6,10],[6,11,6,12],[6,13,6,14],[5,7,5,14],[2,13,2,14],[3,1,3,2],[3,3,3,6],[3,11,3,12],[24,8,24,9],[22,0,22,2],[22,5,22,6],[22,8,22,9],[23,0,23,2],[23,5,23,6],[2,3,2,6],[2,1,2,2],[30,0,30,2],[8,7,8,9],[11,8,11,9],[12,8,12,9],[13,8,13,9],[14,8,14,9],[15,8,15,9],[19,5,19,6],[16,0,16,2],[17,0,17,2],[18,0,18,2],[12,5,12,6],[13,5,13,6],[14,5,14,6],[17,5,17,6],[18,5,18,6],[31,5,31,6],[8,3,9,3],[42,0,42,2],[41,0,41,2],[29,0,29,2],[19,0,19,2],[10,0,10,2],[11,0,11,2],[12,0,12,2],[13,0,13,2],[14,0,14,2],[20,0,20,2],[21,0,21,2],[24,0,24,2],[37,0,37,2],[40,0,40,2],[40,5,40,6],[35,0,35,2],[33,0,33,2],[34,0,34,2],[36,0,36,2],[15,0,15,2],[6,18,6,19],[9,5,9,6],[10,18,10,19],[11,18,11,19],[7,3,7,6],[37,5,37,6],[44,8,44,9],[7,18,7,19],[8,18,8,19],[9,18,9,19],[16,8,16,9],[17,8,17,9],[18,8,18,9],[25,8,25,9],[26,8,26,9],[10,8,10,9],[15,5,15,6],[16,5,16,6],[8,14,9,14],[8,10,8,11],[8,12,8,13],[40,8,40,9],[41,8,41,9],[41,5,41,6],[48,0,48,2],[47,0,47,2],[47,5,47,6],[48,5,48,6],[59,0,59,2],[44,0,44,2],[45,0,45,2],[50,5,50,6],[55,0,55,2],[54,0,54,2],[54,5,54,6],[53,0,53,2],[3,13,3,14],[70,7,70,9],[44,5,44,6],[72,10,72,11],[33,8,33,9],[28,8,28,9],[19,8,19,9],[20,8,20,9],[21,8,21,9],[30,5,30,6],[32,5,32,6],[27,8,27,9],[72,4,72,6],[72,7,72,9],[71,7,71,9],[70,4,70,6],[71,4,71,6],[34,5,34,6],[35,5,35,6],[3,7,3,10],[4,7,4,10],[4,13,4,14],[50,8,50,9],[24,5,24,6],[73,10,73,11],[73,12,73,13],[73,14,74,14],[74,10,74,11],[74,12,74,13],[66,5,66,6],[67,5,67,6],[64,8,64,9],[66,8,66,9],[55,8,55,9],[45,8,45,9],[46,8,46,9],[47,8,47,9],[63,5,63,6],[64,5,64,6],[65,5,65,6],[61,8,61,9],[63,8,63,9],[65,8,65,9],[56,8,56,9],[52,8,52,9],[57,8,57,9],[59,8,59,9],[53,5,53,6],[53,8,53,9],[58,8,58,9],[43,8,43,9],[36,8,36,9],[55,5,55,6],[75,12,75,13],[75,10,75,11],[75,7,75,9],[75,4,75,6],[76,12,76,13],[76,10,76,11],[76,7,76,9],[76,4,76,6],[73,7,73,9],[74,7,74,9],[73,0,73,6],[72,12,72,13],[68,12,68,13],[70,10,70,11],[70,12,70,13],[69,0,69,13],[68,4,68,6],[68,7,68,9],[68,10,68,11],[52,0,52,2],[52,5,52,6],[67,2,67,3],[66,0,67,1],[65,0,65,1],[64,2,64,3],[65,2,65,3],[63,0,63,2],[62,0,62,2],[56,5,56,6],[56,0,56,2],[57,5,57,6],[59,5,59,6],[58,0,58,2],[58,5,58,6],[72,2,72,3],[74,0,74,6],[49,8,49,9],[60,8,60,9],[51,0,51,2],[51,5,51,6],[51,8,51,9],[45,5,45,6],[48,8,48,9],[62,5,62,6],[62,8,62,9],[67,8,67,9],[46,5,46,6],[66,2,66,3],[68,0,68,3],[57,0,57,2],[61,0,61,2],[49,0,49,2],[50,0,50,2],[61,5,61,6],[49,5,49,6],[60,0,60,2],[60,5,60,6],[54,8,54,9]]}
[null,"LS-609 (Part A) - Coarse Aggregates Petrographic Analysis (Petrographic Number, P.N.)"]
["Sample #:",null,null,"Analyst:",null,null,null,null,null,null,null,"Date Tested:"]
["Testing Lab:",null,null,"Telephone #:",null,null,null,null,null,null,null,"Fax #:"]
["Sampled By:",null,null,"Date Sampled:",null,null,null,null,null,null,null,"Sample Type:"]
["Source Name:",null,null,"Source Location:",null,null,null,null,null,null,null,"MAIDB #:"]
["Aggregate Type:",null,null,"Aggregate Product:"]
["CONTRACT #:",null,null,"CONTRACT LOCATION/HWY.:",null,null,null,null,null,null,null,"CONTRACTOR:",null,null,null,null,null,null,"P9.5/R4.75=",null,{"$f":"M73","v":35}]
["LOT NUMBER:",null,null,null,null,null,null,"SUBLOT NUMBER:",null,null,null,null,null,null,null,null,null,null,"P13.2/R9.5=",null,{"$f":"K73","v":30}]
["TYPE ",null,null,"TYPE No.","P",null,{"$f":"\"/R19\"","v":"/R19"},"P19.0/R13.2",null,null,"P13.2 / R9.5",null,"P 9.5 / R4.75",null,"Weighted Composition (%)",null,"F7 = ","I7 = ","P19/R13.2=",null,{"$f":"H73","v":35},"Stockpile","Superpave 12.5 FC2 Course Aggregate"]
[null,null,null,null,"Mass    (g)","%    of Fraction",null,"Mass (g)","% of Fraction",null,"Mass (g)","% of Fraction","Mass (g)","% of Fraction",null,null,75,19,"P____/R19=",null,{"$f":"E72","v":0},"Channelled Face","Superpave 12.5 FC1 Course Aggregate"]
[null,null,null,{"$f":"IF(A11=\"\",\"\",VLOOKUP(A11,GOOD!C$4:G$83,5,FALSE))","v":""},null,{"$f":"IF($E$26=0,0,E11/$E$64*100)","v":0},null,null,{"$f":"IF($H$26=0,0,H11/$H$64*100)","v":0},null,null,{"$f":"IF($K$26=0,0,K11/$K$64*100)","v":0},null,{"$f":"IF($M$26=0,0,M11/$M$64*100)","v":0},{"$f":"(E11/$E$64*$U$10+H11/$H$64*$U$9+K11/$K$64*$U$8+M11/$M$64*$U$7)*100/$P$75","v":0},null,53,13.2,null,null,null,"Road","Superpave 12.5 Course Aggregate",null,"CARBONATE (hard; silty, hard)",null,"01"]
[null,null,null,{"$f":"IF(A12=\"\",\"\",VLOOKUP(A12,GOOD!C$4:G$83,5,FALSE))","v":""},null,0,null,null,0,null,null,0,null,0,0,null,37.5,null,null,null,null,"Belt","SMA 12.5 Course Aggregate",null,"CARBONATE (surface weathering; silty, surface weathering; medium hard; silty, medium hard)",null,"20"]
[null,null,null,{"$f":"IF(A13=\"\",\"\",VLOOKUP(A13,GOOD!C$4:G$83,5,FALSE))","v":""},null,0,null,null,0,null,null,0,null,0,0,null,26.5,null,null,null,null,"Truckbox","SMA 9.5 Course Aggregate",null,"CARBONATE (sandy, hard or medium hard)",null,"02"]
[null,null,null,{"$f":"IF(A14=\"\",\"\",VLOOKUP(A14,GOOD!C$4:G$83,5,FALSE))","v":""},null,0,null,null,0,null,null,0,null,0,0,null,null,null,null,null,null,"Combined Sample","37.5 mm Concrete Course Aggregate",null,"CARBONATE (slightly cherty: <5% chert)",null,"21"]
[null,null,null,{"$f":"IF(A15=\"\",\"\",VLOOKUP(A15,GOOD!C$4:G$83,5,FALSE))","v":""},null,0,null,null,0,null,null,0,null,0,0,null,null,null,null,null,null,"Drill Core","19.0 mm Concrete Course Aggregate",null,"MARBLE (hard or medium hard)",null,"23"]
[null,null,null,{"$f":"IF(A16=\"\",\"\",VLOOKUP(A16,GOOD!C$4:G$83,5,FALSE))","v":""},null,0,null,null,0,null,null,0,null,0,0,null,null,null,null,null,null,null,"16.0 mm Concrete Course Aggregate",null,"CONGLOMERATE – SANDSTONE – ARKOSE (hard)",null,"03"]
[null,null,null,{"$f":"IF(A17=\"\",\"\",VLOOKUP(A17,GOOD!C$4:G$83,5,FALSE))","v":""},null,0,null,null,0,null,null,0,null,0,0,null,null,null,null,null,null,null,"13.2 mm Concrete Course Aggregate",null,"CONGLOMERATE – SANDSTONE – ARKOSE (medium hard)",null,"22"]
[null,null,null,{"$f":"IF(A18=\"\",\"\",VLOOKUP(A18,GOOD!C$4:G$83,5,FALSE))","v":""},null,0,null,null,0,null,null,0,null,0,0,null,null,null,null,null,null,null,"9.5 mm Concrete Course Aggregate",null,"GREYWACKE – ARGILLITE (hard or medium hard)",null,"06"]
[null,null,null,{"$f":"IF(A19=\"\",\"\",VLOOKUP(A19,GOOD!C$4:G$83,5,FALSE))","v":""},null,0,null,null,0,null,null,0,null,0,0,null,null,null,null,null,null,null,"6.7 mm Concrete Course Aggregate",null,"GNEISS – AMPHIBOLITE – SCHIST (hard)",null,"04"]
[null,null,null,{"$f":"IF(A20=\"\",\"\",VLOOKUP(A20,GOOD!C$4:G$83,5,FALSE))","v":""},null,0,null,null,0,null,null,0,null,0,0,null,null,null,null,null,null,null,null,null,"QUARTZITE",null,"05"]
[null,null,null,{"$f":"IF(A21=\"\",\"\",VLOOKUP(A21,GOOD!C$4:G$83,5,FALSE))","v":""},null,0,null,null,0,null,null,0,null,0,0,null,null,null,null,null,null,null,null,null,"GRANITE – DIORITE – GABBRO (hard)",null,"08"]
[null,null,null,{"$f":"IF(A22=\"\",\"\",VLOOKUP(A22,GOOD!C$4:G$83,5,FALSE))","v":""},null,0,null,null,0,null,null,0,null,0,0,null,null,null,null,null,null,null,null,null,"VOLCANIC (hard or medium hard)",null,"07"]
[null,null,null,{"$f":"IF(A23=\"\",\"\",VLOOKUP(A23,GOOD!C$4:G$83,5,FALSE))","v":""},null,0,null,null,0,null,null,0,null,0,0,null,null,null,null,null,null,null,null,null,"VOLCANIC (hard or medium hard)",null,"07"]
[null,null,null,{"$f":"IF(A24=\"\",\"\",VLOOKUP(A24,GOOD!C$4:G$83,5,FALSE))","v":""},null,0,null,null,0,null,null,0,null,0,0,null,null,null,null,null,null,null,null,null,"TRAP (hard)",null,"09"]
[null,null,null,{"$f":"IF(A25=\"\",\"\",VLOOKUP(A25,GOOD!C$4:G$83,5,FALSE))","v":""},null,0,null,null,0,null,null,0,null,0,0,null,null,null,null,null,null,null,null,null,"TRAP (hard)",null,"09"]
["TOTAL GOOD AGGREGATE",null,null,"–",{"$f":"SUM(E11:E25)","v":0},{"$f":"IF(E26=0,0,E26/E64*100)","v":0},null,{"$f":"SUM(H11:H25)","v":0},{"$f":"IF(H26=0,0,H26/H64*100)","v":0},null,{"$f":"SUM(K11:K25)","v":0},{"$f":"IF(K26=0,0,K26/K64*100)","v":0},{"$f":"SUM(M11:M25)","v":0},{"$f":"IF(M26=0,0,M26/M64*100)","v":0},0]
[null,null,null,{"$f":"IF(A27=\"\",\"\",VLOOKUP(A27,FAIR!C$3:G$83,5,FALSE))","v":""},null,{"$f":"IF($E$41=0,0,E27/$E$64*100)","v":0},null,null,{"$f":"IF($H$41=0,0,H27/$H$64*100)","v":0},null,null,{"$f":"IF($K$41=0,0,K27/$K$64*100)","v":0},null,{"$f":"IF($M$41=0,0,M27/$M$64*100)","v":0},0,null,null,null,null,null,null,null,null,null,"CARBONATE (soft; silty, soft; slightly shaley)",null,"35"]
[null,null,null,{"$f":"IF(A28=\"\",\"\",VLOOKUP(A28,FAIR!C$3:G$83,5,FALSE))","v":""},null,0,null,null,0,null,null,0,null,0,0,null,null,null,null,null,null,null,null,null,"CARBONATE (soft; pitted)",null,"41"]
[null,null,null,{"$f":"IF(A29=\"\",\"\",VLOOKUP(A29,FAIR!C$3:G$83,5,FALSE))","v":""},null,0,null,null,0,null,null,0,null,0,0,null,null,null,null,null,null,null,null,null,"CARBONATE (deeply weathered; silty, deeply weathered)",null,"42"]
[null,null,null,{"$f":"IF(A30=\"\",\"\",VLOOKUP(A30,FAIR!C$3:G$83,5,FALSE))","v":""},null,0,null,null,0,null,null,0,null,0,0,null,null,null,null,null,null,null,null,null,"CARBONATE (sandy, soft)",null,"40"]
{"$rows_left_out":47}
{"sheet":"GOOD","index":1,"n_rows":62,"n_cols":7,"rows_kept":62,"cut":false,"hidden":false,"merged":[]}
[]
["GOOD"]
[null,"Rock Type No.","Rock Type Name"]
[null,"1a","CARBONATE (hard)",null,null,null,{"$f":"B4","v":"1a"}]
[null,"1b","CARBONATE (silty, hard)",null,null,null,{"$f":"B5","v":"1b"}]
[null,"20a","CARBONATE (medium hard)",null,null,null,"20a"]
[null,"20b","CARBONATE (silty, medium hard)",null,null,null,"20b"]
[null,"20c","CARBONATE (medium hard, minor shale)",null,null,null,"20c"]
[null,"20d","CARBONATE (surface weathered)",null,null,null,"20d"]
[null,"20e","CARBONATE (silty, surface weathered)",null,null,null,"20e"]
[null,2,"CARBONATE (sandy, hard or medium hard)",null,null,null,2]
[null,21,"CARBONATE (slightly cherty: <5 % chert)",null,null,null,21]
[null,77,"GYPSUM (< 10 % gypsum)",null,null,null,77]
[null,3,"ARENITE SANDSTONE (hard)",null,null,null,3]
[null,22,"ARENITE SANDSTONE (medium hard)",null,null,null,22]
[null,6,"WACKE (hard or medium hard)",null,null,null,6]
[null,16,"ARGILLITE (hard or medium hard)",null,null,null,16]
[null,23,"MARBLE (hard or medium hard)",null,null,null,23]
[null,5,"QUARTZITE",null,null,null,5]
[null,"4a","FELSIC GNEISS (hard)",null,null,null,"4a"]
[null,"4b","INTERMEDIATE GNEISS (hard)",null,null,null,"4b"]
[null,"4c","MAFIC GNEISS (hard)",null,null,null,"4c"]
[null,"14a","FELSIC SCHIST (hard)",null,null,null,"14a"]
[null,"14b","INTERMEDIATE SCHIST (hard)",null,null,null,"14b"]
[null,"14c","MAFIC SCHIST (hard)",null,null,null,"14c"]
[null,"14d","AMPHIBOLITE (hard)",null,null,null,"14d"]
[null,"8a","GRANITE (hard)",null,null,null,"8a"]
[null,"8b","DIORITE (hard)",null,null,null,"8b"]
[null,"8c","GABBRO (hard)",null,null,null,"8c"]
[null,9,"TRAP",null,null,null,9]
{"$rows_left_out":33}
{"sheet":"FAIR","index":2,"n_rows":57,"n_cols":7,"rows_kept":57,"cut":false,"hidden":false,"merged":[]}
[]
["FAIR","Rock Type No.","Rock Type Name"]
[null,"35a","CARBONATE (soft)",null,null,null,{"$f":"B3","v":"35a"}]
[null,"35b","CARBONATE (silty, soft)",null,null,null,{"$f":"B4","v":"35b"}]
[null,"35c","CARBONATE (slightly shaley)",null,null,null,"35c"]
[null,41,"CARBONATE (soft, pitted)",null,null,null,41]
[null,"42a","CARBONATE (deeply weathered)",null,null,null,"42a"]
[null,"42b","CARBONATE (silty, deeply weathered)",null,null,null,"42b"]
[null,40,"CARBONATE (sandy, soft)",null,null,null,40]
[null,"35c","CARBONATE (slightly shaley)",null,null,null,"35c"]
[null,26,"CHERT-CHERTY CARBONATE (<20 % leached CHERT)",null,null,null,26]
[null,30,"ARENITE SANDSTONE (brittle)",null,null,null,30]
[null,29,"WACKE (brittle)",null,null,null,29]
[null,34,"ARGILLITE (medium soft)",null,null,null,34]
[null,24,"MARBLE (brittle)",null,null,null,24]
[null,"25a","FELSIC GNEISS (brittle)",null,null,null,"25a"]
[null,"25b","INTERMEDIATE GNEISS (brittle)",null,null,null,"25b"]
[null,"25c","MAFIC GNEISS (brittle)",null,null,null,"25c"]
[null,"25a","FELSIC SCHIST (brittle)",null,null,null,"25a"]
[null,"25b","INTERMEDIATE SCHIST (brittle)",null,null,null,"25b"]
[null,"25c","MAFIC SCHIST (brittle)",null,null,null,"25c"]
[null,"25d","AMPHIBOLITE (brittle)",null,null,null,"25d"]
[null,"27a","GRANITE (brittle)",null,null,null,"27a"]
[null,"27b","DIORITE (brittle)",null,null,null,"27b"]
[null,"27c","GABBRO (brittle)",null,null,null,"27c"]
[null,"28a","FELSIC VOLCANIC (soft)",null,null,null,"28a"]
[null,"28b","INTERMEDIATE VOLCANIC (soft)",null,null,null,"28b"]
[null,"28c","MAFIC VOLCANIC (soft)",null,null,null,"28c"]
[null,"28d","ULTRAMAFIC VOLCANIC (soft)",null,null,null,"28d"]
[null,73,"VOLCANIC (glassy)",null,null,null,73]
{"$rows_left_out":28}
{"sheet":"POOR","index":3,"n_rows":84,"n_cols":7,"rows_kept":84,"cut":false,"hidden":false,"merged":[]}
[]
["POOR","Rock Type No.","Rock Type Name"]
[null,"43a","CARBONATE (very soft)",null,null,null,{"$f":"B3","v":"43a"}]
[null,"43b","CARBONATE (silty, clayey)",null,null,null,{"$f":"B4","v":"43b"}]
[null,"43c","CARBONATE (shaley)",null,null,null,"43c"]
[null,"43d","CARBONATE (clayey)",null,null,null,"43d"]
[null,"43e","CARBONATE (very soft, deeply weathered)",null,null,null,"43e"]
[null,"44a","CARBONATE (ochreous)",null,null,null,"44a"]
[null,"44b","CARBONATE (sandy, ochreous)",null,null,null,"44b"]
[null,56,"SILTSTONE",null,null,null,56]
[null,"44a","CARBONATE (sandy)",null,null,null,"44a"]
[null,"44b","CARBONATE (sandy, ochreous)",null,null,null,"44b"]
[null,"43c","CARBONATE (shaley)",null,null,null,"43c"]
[null,45,"CHERT-CHERTY CARBONATE (≥20 % leached CHERT)",null,null,null,45]
[null,78,"GYPSUM (10-49 % gypsum)",null,null,null,78]
[null,46,"ARENITE SANDSTONE (friable)",null,null,null,46]
[null,97,"WACKE (friable)",null,null,null,97]
[null,86,"ARGILLITE-TUFFITE-SLATE (soft)",null,null,null,86]
[null,49,"MARBLE (friable)",null,null,null,49]
[null,"50a","FELSIC GNEISS (friable)",null,null,null,"50a"]
[null,"50b","INTERMEDIATE GNEISS (friable)",null,null,null,"50b"]
[null,"50c","MAFIC GNEISS (friable)",null,null,null,"50c"]
[null,"55a","FELSIC SCHIST (soft)",null,null,null,"55a"]
[null,"55b","INTERMEDIATE SCHIST (soft)",null,null,null,"55b"]
[null,"55c","MAFIC SCHIST (soft)",null,null,null,"55c"]
[null,90,"SLATE (soft)",null,null,null,90]
[null,"51a","GRANITE (friable)",null,null,null,"51a"]
[null,"51b","DIORITE (friable)",null,null,null,"51b"]
[null,"51c","GABBRO (friable)",null,null,null,"51c"]
[null,53,"CEMENTATION (partial)",null,null,null,53]
{"$rows_left_out":55}
{"sheet":"DELETERIOUS","index":4,"n_rows":49,"n_cols":7,"rows_kept":49,"cut":false,"hidden":false,"merged":[]}
[]
["DELETERIOUS","Rock Type No.","Rock Type Name"]
[null,"61c","SHALE",null,null,null,{"$f":"B3","v":"61c"}]
[null,"62c","CLAY",null,null,null,{"$f":"B4","v":"62c"}]
[null,"64a","CARBONATE (very weak)",null,null,null,"64a"]
[null,"64b","CARBONATE (very weak, deeply weathered)",null,null,null,"64b"]
[null,79,"GYPSUM (> 49 % gypsum)",null,null,null,79]
[null,32,"Argillite-Tuffite-Slate (very soft)",null,null,null,32]
[null,59,"MARBLE (decomposed)",null,null,null,59]
[null,63,"GNEISS (decomposed)",null,null,null,63]
[null,65,"SCHIST (decomposed)",null,null,null,65]
[null,91,"SLATE (very soft)",null,null,null,91]
[null,"66a","GRANITE (decomposed)",null,null,null,"66a"]
[null,"66b","DIORITE (decomposed)",null,null,null,"66b"]
[null,"66c","GABBRO (decomposed)",null,null,null,"66c"]
[null,63,"VOLCANIC (decomposed)",null,null,null,63]
[null,87,"IRON FORMATION (decomposed)",null,null,null,87]
[null,60,"OCHRE",null,null,null,60]
[null,88,"Sedimentary Rock:  Sibley Group (very soft)",null,null,null,88]
[null,99,"TALC",null,null,null,99]
[null,null,null,null,null,null,0]
[null,null,null,null,null,null,0]
[null,null,null,null,null,null,0]
[null,null,null,null,null,null,0]
[null,null,null,null,null,null,0]
[null,null,null,null,null,null,0]
[null,null,null,null,null,null,0]
[null,null,null,null,null,null,0]
[null,null,null,null,null,null,0]
[null,null,null,null,null,null,0]
{"$rows_left_out":20}
{"sheet":"Full","index":5,"n_rows":280,"n_cols":3,"rows_kept":280,"cut":false,"hidden":false,"merged":[]}
["Sorted by Geo Type and Quality"]
[]
["SEDIMENTARY ROCKS"]
[]
["CARBONATE, SHALEY CARBONATE, SILTY CARBONATE, SILTSTONE, AND CLAY"]
["GOOD"]
[null,"1a.","Carbonate (hard):  high strength; can be scratched (relatively thin scratch); typically unweathered. "]
[null,"1b.  ","Carbonate (silty, hard):  high strength; can be scratched; (relatively thin scratch); raspy sound when scratched; commonly greenish grey; typically unweathered "]
[null,"1c.","Carbonate (hard, minor shale): generally high strength; can be scratched (relatively thick scratch); see Good Category of Table 1 . Very slightly shaley."]
[null,"20a.","Carbonate (medium hard):  high strength; can be scratched (relatively thick scratch)"]
[null,"20b.","Carbonate (silty, medium hard):  high strength; can be scratched (relatively thick scratch); raspy sound when scratched; commonly greenish grey"]
[null,"20c.","Carbonate (medium hard, minor shale): generally high strength; can be scratched (relatively thick scratch); see Good Category of Table 1 "]
[null,"20d.","Carbonate (surface weathered):  mainly high strength; can be scratched; no more than 33 percent of particle consists of medium to low strength weathered material"]
[null,"20e.","Carbonate (silty, surface weathered):  mainly high strength; can be scratched; raspy sound when scratched; commonly greenish grey; no more than 33 percent of particle consists of medium to low strength weathered material"]
["FAIR"]
[null,"35a.","Carbonate (soft):  medium strength; uniform consistency; can be scratched and scraped with ease; can be peeled with difficulty "]
[null,"35b.","Carbonate (silty, soft):  medium strength; can be scratched with ease and scraped with some difficulty; may contain minor low strength zones which can be scraped with ease; raspy sound when scratched; commonly greenish grey "]
[null,"35c.","Carbonate (slightly shaley):  medium strength; can be scratched with ease and scraped with some difficulty; generally shows grey or brown (sometimes greasy) streak when scratched; see Fair Category of Table 1"]
[null,"41.","Carbonate (soft, pitted):  medium strength; can be scratched with ease and scraped with some difficulty; moderately pitted "]
[null,"42a.","Carbonate (deeply weathered):  more than 33 percent of particle consists of medium to low strength weathered material"]
[null,"42b.","Carbonate (silty, deeply weathered):  more than 33 percent of particle consists of medium to low strength weathered material; raspy sound when scratched; commonly greenish grey "]
["POOR"]
[null,"43a.","Carbonate (very soft): contains between 33 and 75 percent very low strength material; can be scraped and peeled with ease"]
[null,"43b.","Carbonate (silty, clayey):  contains between 33 and 75 percent very low strength material; can be scraped and peeled with ease; raspy sound when scratched"]
[null,"43c.","Carbonate (shaley): low strength; can be scraped with ease and peeled with some difficulty; generally shows grey, brown or black (sometimes greasy) streak when scratched. See Poor Category of Table1."]
[null,"43d.","Carbonate (clayey):  contains between 33 and 75 percent very low strength material; can be scraped and peeled with ease "]
[null,"43e.","Carbonate (very soft, deeply weathered):  contains between 33 and 75 percent very low strength deeply weathered material"]
[null,"44a.","Carbonate (ochreous):  contains between 33 and 75 percent ochreous material"]
[null,"44b.","Carbonate (sandy, ochreous): Carbonate (sandy, ochreous):  contains between 33 and 75 percent ochreous material; contains 5 to 49 percent sand-sized quartz grains"]
[null,"56.","Siltstone:  fissile (tends to separate readily along thin bedding planes on which mica flakes can commonly be seen); medium to low strength; poorly cemented; friable (many pieces can be plucked easily from particle) "]
{"$rows_left_out":250}